Target
Gag-Pol polyprotein [600-1027,Y780C]/[600-1155,Y780C]
Ligand
BDBM2037
Substrate
poly(rC)500:oligo(dG)10
Meas. Tech.
HIV-1 RT Assay
pH
7.8±n/a
Temperature
295.15±n/a K
IC50
280±n/a nM
Citation
 Cywin, CLSarver, RWKlunder, JMBills, EHoermann, MBolton, GBratton, LDBrickwood, JRCaspers, NLDavid, EDunbar, JBGrob, PMSchwartz, RHarris, MSPauletti, DHutchings, RHBarringer, KJKennedy, RMShih, CKLarsen, SDPavlovsky, ASorge, CLErickson, DAPfefferkorn, JAJoseph, DPBainbridge, GHattox, SE Thermodynamic and structure guided design of statin based inhibitors of 3-hydroxy-3-methylglutaryl coenzyme A reductase. J Med Chem 51:3804-13 (2008)  
Target
Name:
Gag-Pol polyprotein [600-1027,Y780C]/[600-1155,Y780C]
Synonyms:
EC: 2.7.7.49 | HIV-1 Reverse Transcriptase Mutant (Y181C)
Type:
Protein Complex
Mol. Mass.:
115564
Description:
Components:
This complex has 2 components.
Component 1
Name:
Gag-Pol polyprotein [600-1155,Y780C]
Synonyms:
HIV-1 Reverse Transcriptase Mutant (Y181C) Chain A gag-pol
Type:
Enzyme Subunit
Mol. Mass.:
63868.77
Organism:
Human immunodeficiency virus type 1
Description:
P03366[600-1155,Y780C]
Residue:
556
  
Component 2
Name:
Gag-Pol polyprotein [600-1027,Y780C]
Synonyms:
HIV-1 Reverse Transcriptase Mutant (Y181C) Chain B gag-pol
Type:
Enzyme Subunit
Mol. Mass.:
49908.60
Organism:
Human immunodeficiency virus type 1
Description:
P03366[600-1027,Y780C]
Residue:
428
  
Inhibitor
Name:
BDBM2037
Synonyms:
2,8-disubstituted dipyridodiazepinone 19 8-(3-(Aminocarbonyl)phenyloxy)methyl-2-chloro-5,11-dihydro-11-ethyl-5-methyl-6H-dipyrido[3,2-b:2 ,3 -e][1,4]diazepin-6-one
Type:
Small organic molecule
Emp. Form.:
C22H20ClN5O3
Mol. Mass.:
437.879
SMILES:
CCN1c2nc(Cl)ccc2N(C)C(=O)c2cc(COc3cccc(c3)C(N)=O)cnc12
:
Substrate
Name:
poly(rC)500:oligo(dG)10
Synonyms:
Type:
RNA\DNA duplex
Mol. Mass.:
358.43
Organism:
Description:
The incorporation of Tritium-labeled dGTP onto a (poly)rC:(oligo)dG template:primer.
Residue:
3
NA