Target
Ion channel NompC
Ligand
BDBM46780
Substrate
Meas. Tech.
Dose response cell-based high-throughput screening assay for agonists of the transient receptor potential channel N1 (TRPN1)
EC50
>29900±n/a nM
Citation
 PubChem, PC Dose response cell-based high-throughput screening assay for agonists of the transient receptor potential channel N1 (TRPN1) PubChem Bioassay (2010)[AID] 
Target
Name:
Ion channel NompC
Synonyms:
transient receptor potential cation channel, subfamily N, member 1
Type:
Enzyme Catalytic Domain
Mol. Mass.:
175824.78
Organism:
Danio rerio
Description:
Q7T1G6
Residue:
1614
  
Inhibitor
Name:
BDBM46780
Synonyms:
1-(4-fluoranyl-3-nitro-phenyl)-3-phenyl-urea 1-(4-fluoro-3-nitrophenyl)-3-phenylurea N-(4-fluoro-3-nitrophenyl)-N'-phenylurea cid_844760
Type:
Small organic molecule
Emp. Form.:
C13H10FN3O3
Mol. Mass.:
275.2352
SMILES:
[O-][N+](=O)c1cc(NC(=O)Nc2ccccc2)ccc1F
: