Target
Ion channel NompC
Ligand
BDBM46804
Substrate
Meas. Tech.
Dose response cell-based high-throughput screening assay for agonists of the transient receptor potential channel N1 (TRPN1)
EC50
3970±n/a nM
Citation
 PubChem, PC Dose response cell-based high-throughput screening assay for agonists of the transient receptor potential channel N1 (TRPN1) PubChem Bioassay (2010)[AID] 
Target
Name:
Ion channel NompC
Synonyms:
transient receptor potential cation channel, subfamily N, member 1
Type:
Enzyme Catalytic Domain
Mol. Mass.:
175824.78
Organism:
Danio rerio
Description:
Q7T1G6
Residue:
1614
  
Inhibitor
Name:
BDBM46804
Synonyms:
10-methyl-3-(2-phenylethyl)-2-propan-2-yl-pyrimido[4,5-b]quinoline-4,5-dione 2-Isopropyl-10-methyl-3-phenethyl-3H,10H-pyrimido[4,5-b]quinoline-4,5-dione MLS000767168 cid_2035550
Type:
Small organic molecule
Emp. Form.:
C23H23N3O2
Mol. Mass.:
373.4476
SMILES:
CC(C)c1nc2n(C)c3ccccc3c(=O)c2c(=O)n1CCc1ccccc1
: