Target
Ion channel NompC
Ligand
BDBM46807
Substrate
Meas. Tech.
Dose response cell-based high-throughput screening assay for agonists of the transient receptor potential channel N1 (TRPN1)
EC50
1620±n/a nM
Citation
 PubChem, PC Dose response cell-based high-throughput screening assay for agonists of the transient receptor potential channel N1 (TRPN1) PubChem Bioassay (2010)[AID] 
Target
Name:
Ion channel NompC
Synonyms:
transient receptor potential cation channel, subfamily N, member 1
Type:
Enzyme Catalytic Domain
Mol. Mass.:
175824.78
Organism:
Danio rerio
Description:
Q7T1G6
Residue:
1614
  
Inhibitor
Name:
BDBM46807
Synonyms:
(2E)-3-ethyl-2-[(2Z)-2-(3-ethyl-4-keto-2-thioxo-thiazolidin-5-ylidene)ethylidene]-N,N-dimethyl-1-phenyl-benzimidazole-5-sulfonamide (2E)-3-ethyl-2-[(2Z)-2-(3-ethyl-4-oxo-2-sulfanylidene-1,3-thiazolidin-5-ylidene)ethylidene]-N,N-dimethyl-1-phenylbenzimidazole-5-sulfonamide 3-Ethyl-2-[2-[3-ethyl-4-oxo-2-thioxo-thiazolidin-(5Z)-ylidene]-eth-(E)-ylidene]-1-phenyl-2,3-dihydro-1H-b enzoimidazole-5-sulfonic acid dimethylamide SMR000413833 | cid_16412561
Type:
Small organic molecule
Emp. Form.:
C24H26N4O3S3
Mol. Mass.:
514.683
SMILES:
CCN1C(=S)S\C(=C/C=C2\N(CC)c3cc(ccc3N2c2ccccc2)S(=O)(=O)N(C)C)C1=O
: