Target
Transitional endoplasmic reticulum ATPase
Ligand
BDBM46584
Substrate
Meas. Tech.
Luminescence counterscreen assay for p97 inhibitors: Dose response biochemical high throughput screening assay to identify inhibitors of the C522A mutant p97 ATPase.
IC50
>50000±n/a nM
Citation
 PubChem, PC Luminescence counterscreen assay for p97 inhibitors: Dose response biochemical high throughput screening assay to identify inhibitors of the C522A mutant p97 ATPase. PubChem Bioassay (2009)[AID] 
Target
Name:
Transitional endoplasmic reticulum ATPase
Synonyms:
TERA_HUMAN VCP Valosin-containing protein
Type:
Enzyme
Mol. Mass.:
89300.63
Organism:
Homo sapiens (Human)
Description:
P55072
Residue:
806
  
Inhibitor
Name:
BDBM46584
Synonyms:
2-N,4-N-dibenzylquinazoline-2,4-diamine;hydrochloride N*2*,N*4*-Dibenzyl-quinazoline-2,4-diamine SMR000434303 cid_16472035
Type:
Small organic molecule
Emp. Form.:
C22H20N4
Mol. Mass.:
340.421
SMILES:
C(Nc1nc(NCc2ccccc2)c2ccccc2n1)c1ccccc1
: