Target
Mucolipin-3
Ligand
BDBM46825
Substrate
Meas. Tech.
Dose response cell-based high-throughput screening assay for agonists of the transient receptor potential channel ML3 (TRPML3)
EC50
781±n/a nM
Citation
 PubChem, PC Dose response cell-based high-throughput screening assay for agonists of the transient receptor potential channel ML3 (TRPML3) PubChem Bioassay (2009)[AID] 
Target
Name:
Mucolipin-3
Synonyms:
MCLN3_HUMAN MCOLN3 protein
Type:
Enzyme Catalytic Domain
Mol. Mass.:
64244.09
Organism:
Homo sapiens (Human)
Description:
Q8TDD5
Residue:
553
  
Inhibitor
Name:
BDBM46825
Synonyms:
MLS000080225 N-tert-butyl-3-(3-tert-butyl-1-methyl-7-oxo-4H-pyrazolo[4,3-d]pyrimidin-5-yl)-4-ethoxybenzenesulfonamide SMR000057796 | cid_659121
Type:
Small organic molecule
Emp. Form.:
C22H31N5O4S
Mol. Mass.:
461.578
SMILES:
CCOc1ccc(cc1-c1nc2c(nn(C)c2c(=O)[nH]1)C(C)(C)C)S(=O)(=O)NC(C)(C)C
: