Target
Mucolipin-3
Ligand
BDBM46829
Substrate
Meas. Tech.
Dose response cell-based high-throughput screening assay for agonists of the transient receptor potential channel ML3 (TRPML3)
EC50
>29900±n/a nM
Citation
 PubChem, PC Dose response cell-based high-throughput screening assay for agonists of the transient receptor potential channel ML3 (TRPML3) PubChem Bioassay (2009)[AID] 
Target
Name:
Mucolipin-3
Synonyms:
MCLN3_HUMAN MCOLN3 protein
Type:
Enzyme Catalytic Domain
Mol. Mass.:
64244.09
Organism:
Homo sapiens (Human)
Description:
Q8TDD5
Residue:
553
  
Inhibitor
Name:
BDBM46829
Synonyms:
1-tert-butyl-3-methyl-4-[(4-methylphenyl)sulfonyl]-1H-pyrazol-5-yl cyclopentanecarboxylate SMR000025362 [2-tert-butyl-5-methyl-4-(4-methylphenyl)sulfonylpyrazol-3-yl] cyclopentanecarboxylate cyclopentanecarboxylic acid (2-tert-butyl-5-methyl-4-tosyl-pyrazol-3-yl) ester | cyclopentanecarboxylic acid [2-tert-butyl-5-methyl-4-(4-methylphenyl)sulfonyl-3-pyrazolyl] ester
Type:
Small organic molecule
Emp. Form.:
C21H28N2O4S
Mol. Mass.:
404.523
SMILES:
Cc1nn(c(OC(=O)C2CCCC2)c1S(=O)(=O)c1ccc(C)cc1)C(C)(C)C
: