Target
Mucolipin-3
Ligand
BDBM46834
Substrate
Meas. Tech.
Dose response cell-based high-throughput screening assay for agonists of the transient receptor potential channel ML3 (TRPML3)
EC50
>29900±n/a nM
Citation
 PubChem, PC Dose response cell-based high-throughput screening assay for agonists of the transient receptor potential channel ML3 (TRPML3) PubChem Bioassay (2009)[AID] 
Target
Name:
Mucolipin-3
Synonyms:
MCLN3_HUMAN MCOLN3 protein
Type:
Enzyme Catalytic Domain
Mol. Mass.:
64244.09
Organism:
Homo sapiens (Human)
Description:
Q8TDD5
Residue:
553
  
Inhibitor
Name:
BDBM46834
Synonyms:
3-(2-chlorophenyl)-5-methyl-N-[3-(3-methyl-2-imidazo[1,2-a]pyrimidinyl)phenyl]-4-isoxazolecarboxamide 3-(2-chlorophenyl)-5-methyl-N-[3-(3-methylimidazo[1,2-a]pyrimidin-2-yl)phenyl]isoxazole-4-carboxamide SMR000028327 | cid_3242922
Type:
Small organic molecule
Emp. Form.:
C24H18ClN5O2
Mol. Mass.:
443.885
SMILES:
Cc1onc(c1C(=O)Nc1cccc(c1)-c1nc2ncccn2c1C)-c1ccccc1Cl
: