Target
Mucolipin-3
Ligand
BDBM46837
Substrate
Meas. Tech.
Dose response cell-based high-throughput screening assay for agonists of the transient receptor potential channel ML3 (TRPML3)
EC50
8950±n/a nM
Citation
 PubChem, PC Dose response cell-based high-throughput screening assay for agonists of the transient receptor potential channel ML3 (TRPML3) PubChem Bioassay (2009)[AID] 
Target
Name:
Mucolipin-3
Synonyms:
MCLN3_HUMAN MCOLN3 protein
Type:
Enzyme Catalytic Domain
Mol. Mass.:
64244.09
Organism:
Homo sapiens (Human)
Description:
Q8TDD5
Residue:
553
  
Inhibitor
Name:
BDBM46837
Synonyms:
MLS000065718 N-(4,5-dimethyl-2-thiazolyl)-1-benzothiophene-3-carboxamide SMR000080385 | cid_1225717
Type:
Small organic molecule
Emp. Form.:
C14H12N2OS2
Mol. Mass.:
288.388
SMILES:
Cc1nc(NC(=O)c2csc3ccccc23)sc1C
: