Target
Mucolipin-3
Ligand
BDBM46852
Substrate
Meas. Tech.
Dose response cell-based high-throughput screening assay for agonists of the transient receptor potential channel ML3 (TRPML3)
EC50
5080±n/a nM
Citation
 PubChem, PC Dose response cell-based high-throughput screening assay for agonists of the transient receptor potential channel ML3 (TRPML3) PubChem Bioassay (2009)[AID] 
Target
Name:
Mucolipin-3
Synonyms:
MCLN3_HUMAN MCOLN3 protein
Type:
Enzyme Catalytic Domain
Mol. Mass.:
64244.09
Organism:
Homo sapiens (Human)
Description:
Q8TDD5
Residue:
553
  
Inhibitor
Name:
BDBM46852
Synonyms:
2-(2-methylphenoxy)-N-(2-morpholin-4-ylphenyl)acetamide 2-(2-methylphenoxy)-N-(2-morpholinophenyl)acetamide MLS000113844 cid_896200
Type:
Small organic molecule
Emp. Form.:
C19H22N2O3
Mol. Mass.:
326.3896
SMILES:
Cc1ccccc1OCC(=O)Nc1ccccc1N1CCOCC1
: