Target
Mucolipin-3
Ligand
BDBM46865
Substrate
Meas. Tech.
Dose response cell-based high-throughput screening assay for agonists of the transient receptor potential channel ML3 (TRPML3)
EC50
10500±n/a nM
Citation
 PubChem, PC Dose response cell-based high-throughput screening assay for agonists of the transient receptor potential channel ML3 (TRPML3) PubChem Bioassay (2009)[AID] 
Target
Name:
Mucolipin-3
Synonyms:
MCLN3_HUMAN MCOLN3 protein
Type:
Enzyme Catalytic Domain
Mol. Mass.:
64244.09
Organism:
Homo sapiens (Human)
Description:
Q8TDD5
Residue:
553
  
Inhibitor
Name:
BDBM46865
Synonyms:
4-({2-isopropyl-3-[(4-methylphenyl)sulfonyl]-1-imidazolidinyl}carbonyl)-3,5-bis(methylsulfanyl)isothiazole SMR000113311 [3,5-bis(methylsulfanyl)-1,2-thiazol-4-yl]-[3-(4-methylphenyl)sulfonyl-2-propan-2-ylimidazolidin-1-yl]methanone [3,5-bis(methylthio)isothiazol-4-yl]-(2-isopropyl-3-tosyl-imidazolidin-1-yl)methanone | cid_5196967
Type:
Small organic molecule
Emp. Form.:
C19H25N3O3S4
Mol. Mass.:
471.68
SMILES:
CSc1nsc(SC)c1C(=O)N1CCN(C1C(C)C)S(=O)(=O)c1ccc(C)cc1
: