Target
Mucolipin-3
Ligand
BDBM46895
Substrate
Meas. Tech.
Dose response cell-based high-throughput screening assay for agonists of the transient receptor potential channel ML3 (TRPML3)
EC50
5230±n/a nM
Citation
 PubChem, PC Dose response cell-based high-throughput screening assay for agonists of the transient receptor potential channel ML3 (TRPML3) PubChem Bioassay (2009)[AID] 
Target
Name:
Mucolipin-3
Synonyms:
MCLN3_HUMAN MCOLN3 protein
Type:
Enzyme Catalytic Domain
Mol. Mass.:
64244.09
Organism:
Homo sapiens (Human)
Description:
Q8TDD5
Residue:
553
  
Inhibitor
Name:
BDBM46895
Synonyms:
4,6-dimethyl-3-(4-methylphenyl)sulfonyl-2-[3-(trifluoromethyl)phenoxy]pyridine 4,6-dimethyl-3-tosyl-2-[3-(trifluoromethyl)phenoxy]pyridine SMR000179185 | cid_1488733
Type:
Small organic molecule
Emp. Form.:
C21H18F3NO3S
Mol. Mass.:
421.433
SMILES:
Cc1ccc(cc1)S(=O)(=O)c1c(C)cc(C)nc1Oc1cccc(c1)C(F)(F)F
: