Target
Mucolipin-3
Ligand
BDBM46968
Substrate
Meas. Tech.
Dose response cell-based high-throughput screening assay for agonists of the transient receptor potential channel ML3 (TRPML3)
EC50
3580±n/a nM
Citation
 PubChem, PC Dose response cell-based high-throughput screening assay for agonists of the transient receptor potential channel ML3 (TRPML3) PubChem Bioassay (2009)[AID] 
Target
Name:
Mucolipin-3
Synonyms:
MCLN3_HUMAN MCOLN3 protein
Type:
Enzyme Catalytic Domain
Mol. Mass.:
64244.09
Organism:
Homo sapiens (Human)
Description:
Q8TDD5
Residue:
553
  
Inhibitor
Name:
BDBM46968
Synonyms:
3-cyano-N-cyclohexyl-N-methyl-benzenesulfonamide MLS000775568 cid_2546741
Type:
Small organic molecule
Emp. Form.:
C14H18N2O2S
Mol. Mass.:
278.37
SMILES:
CN(C1CCCCC1)S(=O)(=O)c1cccc(c1)C#N
: