Target
Mucolipin-3
Ligand
BDBM46988
Substrate
Meas. Tech.
Dose response cell-based high-throughput screening assay for agonists of the transient receptor potential channel ML3 (TRPML3)
EC50
>29900±n/a nM
Citation
 PubChem, PC Dose response cell-based high-throughput screening assay for agonists of the transient receptor potential channel ML3 (TRPML3) PubChem Bioassay (2009)[AID] 
Target
Name:
Mucolipin-3
Synonyms:
MCLN3_HUMAN MCOLN3 protein
Type:
Enzyme Catalytic Domain
Mol. Mass.:
64244.09
Organism:
Homo sapiens (Human)
Description:
Q8TDD5
Residue:
553
  
Inhibitor
Name:
BDBM46988
Synonyms:
2-(4-besyl-1,4-diazepan-1-yl)-4-(trifluoromethyl)pyrimidine-5-carboxylic acid methyl ester MLS000850159 cid_2811317 methyl 2-[4-(phenylsulfonyl)-1,4-diazepan-1-yl]-4-(trifluoromethyl)-5-pyrimidinecarboxylate | methyl 2-[4-(phenylsulfonyl)-1,4-diazepan-1-yl]-4-(trifluoromethyl)pyrimidine-5-carboxylate
Type:
Small organic molecule
Emp. Form.:
C18H19F3N4O4S
Mol. Mass.:
444.428
SMILES:
COC(=O)c1cnc(nc1C(F)(F)F)N1CCCN(CC1)S(=O)(=O)c1ccccc1
: