Target
Procathepsin L
Ligand
BDBM35493
Substrate
Meas. Tech.
Cathepsin L dose-response testing in the presence of cysteine
IC50
19.92±2.02 nM
Citation
 PubChem, PC Cathepsin L dose-response testing in the presence of cysteine PubChem Bioassay (2009)[AID] 
Target
Name:
Procathepsin L
Synonyms:
CATL1_HUMAN CTSL CTSL1 Cathepsin L Cathepsin L1 heavy chain MEP cathepsin L preproprotein
Type:
Enzyme
Mol. Mass.:
37557.19
Organism:
Homo sapiens (Human)
Description:
Purchased from Calbiochem (San Diego, CA).
Residue:
333
  
Inhibitor
Name:
BDBM35493
Synonyms:
(2R,3R)-3-[[(1S)-1-(4-guanidinobutylcarbamoyl)-3-methyl-butyl]carbamoyl]oxirane-2-carboxylic acid (2R,3R)-3-[[(2S)-1-[4-[bis(azanyl)methylideneamino]butylamino]-4-methyl-1-oxidanylidene-pentan-2-yl]carbamoyl]oxirane-2-carboxylic acid E-64 SMR000058838 | cid_439487
Type:
Small organic molecule
Emp. Form.:
C15H27N5O5
Mol. Mass.:
357.4054
SMILES:
[#6]-[#6](-[#6])-[#6]-[#6@H](-[#7]-[#6](=O)-[#6@@H]-1-[#8]-[#6@H]-1-[#6](-[#8])=O)-[#6](=O)-[#7]-[#6]-[#6]-[#6]-[#6]\[#7]=[#6](\[#7])-[#7]
: