Target
Procathepsin L
Ligand
BDBM41144
Substrate
Meas. Tech.
Cathepsin L dose-response testing in the presence of cysteine
IC50
2869.076667±372.694514 nM
Citation
 PubChem, PC Cathepsin L dose-response testing in the presence of cysteine PubChem Bioassay (2009)[AID] 
Target
Name:
Procathepsin L
Synonyms:
CATL1_HUMAN CTSL CTSL1 Cathepsin L Cathepsin L1 heavy chain MEP cathepsin L preproprotein
Type:
Enzyme
Mol. Mass.:
37557.19
Organism:
Homo sapiens (Human)
Description:
Purchased from Calbiochem (San Diego, CA).
Residue:
333
  
Inhibitor
Name:
BDBM41144
Synonyms:
(1S)-1-[5-[(3-fluorophenyl)methylsulfonyl]-1,3,4-oxadiazol-2-yl]-3-methyl-1-butanamine;hydrochloride (1S)-1-[5-[(3-fluorophenyl)methylsulfonyl]-1,3,4-oxadiazol-2-yl]-3-methylbutan-1-amine;hydrochloride SMR000044708 cid_6603229
Type:
Small organic molecule
Emp. Form.:
C14H18FN3O3S
Mol. Mass.:
327.374
SMILES:
CC(C)C[C@H](N)c1nnc(o1)S(=O)(=O)Cc1cccc(F)c1
: