Target
Transitional endoplasmic reticulum ATPase
Ligand
BDBM47022
Substrate
Meas. Tech.
Luminescence counterscreen assay for p97 inhibitors: dose response biochemical high throughput screening assay to identify inhibitors of the C522A mutant p97 ATPase: synthesized compounds.
IC50
>50000±n/a nM
Citation
 PubChem, PC Luminescence counterscreen assay for p97 inhibitors: dose response biochemical high throughput screening assay to identify inhibitors of the C522A mutant p97 ATPase: synthesized compounds. PubChem Bioassay (2009)[AID] 
Target
Name:
Transitional endoplasmic reticulum ATPase
Synonyms:
TERA_HUMAN VCP Valosin-containing protein
Type:
Enzyme
Mol. Mass.:
89300.63
Organism:
Homo sapiens (Human)
Description:
P55072
Residue:
806
  
Inhibitor
Name:
BDBM47022
Synonyms:
4-[[4-(2,4-dihydroxyphenyl)-1,3-thiazol-2-yl]amino]-2-(trifluoromethyl)benzonitrile 4-[[4-(2,4-dihydroxyphenyl)thiazol-2-yl]amino]-2-(trifluoromethyl)benzonitrile ML080 SR-03000000673-1 | cid_25110544
Type:
Small organic molecule
Emp. Form.:
C17H10F3N3O2S
Mol. Mass.:
377.34
SMILES:
Oc1ccc(-c2csc(Nc3ccc(C#N)c(c3)C(F)(F)F)n2)c(O)c1
: