Target
Protein-tyrosine kinase 2-beta
Ligand
BDBM33089
Substrate
Meas. Tech.
TR-FRET counterscreen for FAK inhibitors: dose-response biochemical high throughput screening assay to identify inhibitors of Proline-rich tyrosine kinase 2 (Pyk2)
IC50
1825±n/a nM
Citation
 PubChem, PC TR-FRET counterscreen for FAK inhibitors: dose-response biochemical high throughput screening assay to identify inhibitors of Proline-rich tyrosine kinase 2 (Pyk2) PubChem Bioassay (2009)[AID] 
Target
Name:
Protein-tyrosine kinase 2-beta
Synonyms:
FAK2 PTK2B PTK2B protein tyrosine kinase 2 beta (PTK2B) Protein tyrosine kinase 2 beta | RAFTK
Type:
Protein
Mol. Mass.:
115868.80
Organism:
Homo sapiens (Human)
Description:
Q14289
Residue:
1009
  
Inhibitor
Name:
BDBM33089
Synonyms:
(3-methyl-4-pyrrolidino-phenyl)amine;hydrochloride 3-methyl-4-pyrrolidin-1-yl-aniline;hydrochloride MLS000566003 cid_109673
Type:
Small organic molecule
Emp. Form.:
C11H16N2
Mol. Mass.:
176.2581
SMILES:
Cc1cc(N)ccc1N1CCCC1
: