Target
Phosphomannomutase 2
Ligand
BDBM33049
Substrate
Meas. Tech.
Counter screen SAR assay for PMM2 inhibitors via a fluorescence intensity assay
IC50
>100000±n/a nM
Citation
 PubChem, PC Counter screen SAR assay for PMM2 inhibitors via a fluorescence intensity assay PubChem Bioassay (2010)[AID] 
Target
Name:
Phosphomannomutase 2
Synonyms:
PMM2 | PMM2_HUMAN
Type:
Enzyme Catalytic Domain
Mol. Mass.:
28082.33
Organism:
Homo sapiens (Human)
Description:
gi_4557839
Residue:
246
  
Inhibitor
Name:
BDBM33049
Synonyms:
(4-chlorodithiazol-5-ylidene)-(3,5-dimethoxyphenyl)amine 4-chloro-N-(3,5-dimethoxyphenyl)-5-dithiazolimine MLS000044018 SMR000021429 | cid_715724
Type:
Small organic molecule
Emp. Form.:
C10H9ClN2O2S2
Mol. Mass.:
288.774
SMILES:
COc1cc(OC)cc(c1)\N=c1\ssnc1Cl
: