Target
Phosphomannomutase 2
Ligand
BDBM46652
Substrate
Meas. Tech.
Counter screen SAR assay for PMM2 inhibitors via a fluorescence intensity assay
IC50
>100000±n/a nM
Citation
 PubChem, PC Counter screen SAR assay for PMM2 inhibitors via a fluorescence intensity assay PubChem Bioassay (2010)[AID] 
Target
Name:
Phosphomannomutase 2
Synonyms:
PMM2 | PMM2_HUMAN
Type:
Enzyme Catalytic Domain
Mol. Mass.:
28082.33
Organism:
Homo sapiens (Human)
Description:
gi_4557839
Residue:
246
  
Inhibitor
Name:
BDBM46652
Synonyms:
2-(4-methyl-1,3-thiazol-2-yl)-1,2-benzothiazol-3-one 2-(4-methylthiazol-2-yl)-1,2-benzothiazol-3-one cid_2328663
Type:
Small organic molecule
Emp. Form.:
C11H8N2OS2
Mol. Mass.:
248.324
SMILES:
Cc1csc(n1)-n1sc2ccccc2c1=O
: