Target
Phosphomannomutase 2
Ligand
BDBM46692
Substrate
Meas. Tech.
Counter screen SAR assay for PMM2 inhibitors via a fluorescence intensity assay
IC50
>100000±n/a nM
Citation
 PubChem, PC Counter screen SAR assay for PMM2 inhibitors via a fluorescence intensity assay PubChem Bioassay (2010)[AID] 
Target
Name:
Phosphomannomutase 2
Synonyms:
PMM2 | PMM2_HUMAN
Type:
Enzyme Catalytic Domain
Mol. Mass.:
28082.33
Organism:
Homo sapiens (Human)
Description:
gi_4557839
Residue:
246
  
Inhibitor
Name:
BDBM46692
Synonyms:
2-(3-iodanylphenyl)-1,2-benzothiazol-3-one MLS-0390877.0001 | cid_25181207
Type:
Small organic molecule
Emp. Form.:
C13H8INOS
Mol. Mass.:
353.178
SMILES:
Ic1cccc(c1)-n1sc2ccccc2c1=O
: