Target
Phosphomannomutase 2
Ligand
BDBM46699
Substrate
Meas. Tech.
Counter screen SAR assay for PMM2 inhibitors via a fluorescence intensity assay
IC50
>100000±n/a nM
Citation
 PubChem, PC Counter screen SAR assay for PMM2 inhibitors via a fluorescence intensity assay PubChem Bioassay (2010)[AID] 
Target
Name:
Phosphomannomutase 2
Synonyms:
PMM2 | PMM2_HUMAN
Type:
Enzyme Catalytic Domain
Mol. Mass.:
28082.33
Organism:
Homo sapiens (Human)
Description:
gi_4557839
Residue:
246
  
Inhibitor
Name:
BDBM46699
Synonyms:
4-[(4-chloranyl-1,2,3-dithiazol-5-ylidene)amino]-N,N-dimethyl-aniline 4-[(4-chlorodithiazol-5-ylidene)amino]-N,N-dimethylaniline [4-[(4-chlorodithiazol-5-ylidene)amino]phenyl]-dimethyl-amine | cid_25181210
Type:
Small organic molecule
Emp. Form.:
C10H10ClN3S2
Mol. Mass.:
271.79
SMILES:
CN(C)c1ccc(cc1)\N=c1\ssnc1Cl
: