Target
Phosphoethanolamine/phosphocholine phosphatase
Ligand
BDBM46689
Substrate
Meas. Tech.
SAR assay for compounds that inhibit PHOSPHO1
IC50
2730±n/a nM
Citation
 PubChem, PC SAR assay for compounds that inhibit PHOSPHO1 PubChem Bioassay (2010)[AID] 
Target
Name:
Phosphoethanolamine/phosphocholine phosphatase
Synonyms:
PHOP1_HUMAN phosphatase, orphan 1
Type:
Enzyme Catalytic Domain
Mol. Mass.:
29718.09
Organism:
Homo sapiens (Human)
Description:
Q8TCT1
Residue:
267
  
Inhibitor
Name:
BDBM46689
Synonyms:
2-(3-methylphenyl)-1,2-benzothiazol-3-one MLS-0390872.0001 | cid_22416241
Type:
Small organic molecule
Emp. Form.:
C14H11NOS
Mol. Mass.:
241.308
SMILES:
Cc1cccc(c1)-n1sc2ccccc2c1=O
: