Target
Ectonucleotide pyrophosphatase/phosphodiesterase family member 2
Ligand
BDBM209591
Substrate
Meas. Tech.
FS-3 Assay
IC50
1158±n/a nM
Citation
 Gibson, KROwen, DR Substituted pyridazines for the treatment of pain US Patent  US10016420 Publication Date 7/10/2018 
Target
Name:
Ectonucleotide pyrophosphatase/phosphodiesterase family member 2
Synonyms:
ATX Autotaxin (ATX) ENPP2 Ectonucleotide Pyrophosphatase/Phosphodiesterase 2 (ENPP2) Extracellular lysophospholipase D PDNP2
Type:
Enzyme
Mol. Mass.:
99007.13
Organism:
Homo sapiens (Human)
Description:
Q13822
Residue:
863
  
Inhibitor
Name:
BDBM209591
Synonyms:
US10016420, 12 | US9273011, 12
Type:
Small organic molecule
Emp. Form.:
C21H24N6O2
Mol. Mass.:
392.4543
SMILES:
Cc1noc(NC(=O)c2ccc(NC3CCN(Cc4ccccc4)C3)nn2)c1C
: