Target
Broad substrate specificity ATP-binding cassette transporter ABCG2
Ligand
BDBM47384
Substrate
Meas. Tech.
Dose Response for ABC transporter inhibitors: specifically ABCG2 screen, ABCB1 counter-screen
EC50
1040±n/a nM
Citation
 PubChem, PC Dose Response for ABC transporter inhibitors: specifically ABCG2 screen, ABCB1 counter-screen PubChem Bioassay (2009)[AID] 
Target
Name:
Broad substrate specificity ATP-binding cassette transporter ABCG2
Synonyms:
ABCG2 ABCP ATP-binding cassette sub-family G member 2 ATP-binding cassette, sub-family G, member 2 BCRP1 CDw338 Mitoxantrone resistance-associated protein Urate exporter
Type:
Multi-pass membrane protein; monomer or homodimer; disulfide-linked
Mol. Mass.:
72329.48
Organism:
Homo sapiens (Human)
Description:
Q9UNQ0
Residue:
655
  
Inhibitor
Name:
BDBM47384
Synonyms:
(6E)-6-[4-(3,5-dimethyl-1-piperidinyl)-1H-quinazolin-2-ylidene]-2-methoxy-1-cyclohexa-2,4-dienone (6E)-6-[4-(3,5-dimethylpiperidin-1-yl)-1H-quinazolin-2-ylidene]-2-methoxycyclohexa-2,4-dien-1-one UNM000011097701 | cid_5389318
Type:
Small organic molecule
Emp. Form.:
C22H25N3O2
Mol. Mass.:
363.4528
SMILES:
COc1cccc(c1O)-c1nc(N2CC(C)CC(C)C2)c2ccccc2n1
: