Target
Tyrosine-protein kinase JAK2
Ligand
BDBM33524
Substrate
Meas. Tech.
Luminescent counterscreen for inhibitors of the Janus kinase 2 mutant JAK2V617F: dose response cell-based high throughput screening assay for inhibitors of parental Ba/F3 cell viability.
IC50
4670±n/a nM
Citation
 PubChem, PC Luminescent counterscreen for inhibitors of the Janus kinase 2 mutant JAK2V617F: dose response cell-based high throughput screening assay for inhibitors of parental Ba/F3 cell viability. PubChem Bioassay (2009)[AID] 
Target
Name:
Tyrosine-protein kinase JAK2
Synonyms:
JAK-2 JAK2_HUMAN Janus kinase 2 (JAK2) | Janus kinase 2 (a protein tyrosine kinase)
Type:
Protein
Mol. Mass.:
130684.68
Organism:
Homo sapiens (Human)
Description:
O60674
Residue:
1132
  
Inhibitor
Name:
BDBM33524
Synonyms:
MLS000041935 N-[(1R)-2-methyl-1-[5-[(3-methylphenyl)methylsulfonyl]-1,3,4-oxadiazol-2-yl]butyl]carbamic acid tert-butyl ester cid_665480 | tert-butyl N-[(1R)-2-methyl-1-[5-[(3-methylphenyl)methylsulfonyl]-1,3,4-oxadiazol-2-yl]butyl]carbamate
Type:
Small organic molecule
Emp. Form.:
C20H29N3O5S
Mol. Mass.:
423.526
SMILES:
CCC(C)[C@@H](NC(=O)OC(C)(C)C)c1nnc(o1)S(=O)(=O)Cc1cccc(C)c1
: