Target
Tyrosine-protein kinase JAK2
Ligand
BDBM47413
Substrate
Meas. Tech.
Luminescent counterscreen for inhibitors of the Janus kinase 2 mutant JAK2V617F: dose response cell-based high throughput screening assay for inhibitors of parental Ba/F3 cell viability.
IC50
7519±n/a nM
Citation
 PubChem, PC Luminescent counterscreen for inhibitors of the Janus kinase 2 mutant JAK2V617F: dose response cell-based high throughput screening assay for inhibitors of parental Ba/F3 cell viability. PubChem Bioassay (2009)[AID] 
Target
Name:
Tyrosine-protein kinase JAK2
Synonyms:
JAK-2 JAK2_HUMAN Janus kinase 2 (JAK2) | Janus kinase 2 (a protein tyrosine kinase)
Type:
Protein
Mol. Mass.:
130684.68
Organism:
Homo sapiens (Human)
Description:
O60674
Residue:
1132
  
Inhibitor
Name:
BDBM47413
Synonyms:
3-Cyclohexyl-6-(3,4-dimethoxy-phenyl)-7H-[1,2,4]triazolo[3,4-b][1,3,4]thiadiazine MLS000557010 cid_3523871
Type:
Small organic molecule
Emp. Form.:
C18H22N4O2S
Mol. Mass.:
358.458
SMILES:
COc1ccc(cc1OC)C1=Nn2c(SC1)nnc2C1CCCCC1
: