Target
Tyrosine-protein kinase JAK2
Ligand
BDBM47432
Substrate
Meas. Tech.
Luminescent counterscreen for inhibitors of the Janus kinase 2 mutant JAK2V617F: dose response cell-based high throughput screening assay for inhibitors of parental Ba/F3 cell viability.
IC50
3850±n/a nM
Citation
 PubChem, PC Luminescent counterscreen for inhibitors of the Janus kinase 2 mutant JAK2V617F: dose response cell-based high throughput screening assay for inhibitors of parental Ba/F3 cell viability. PubChem Bioassay (2009)[AID] 
Target
Name:
Tyrosine-protein kinase JAK2
Synonyms:
JAK-2 JAK2_HUMAN Janus kinase 2 (JAK2) | Janus kinase 2 (a protein tyrosine kinase)
Type:
Protein
Mol. Mass.:
130684.68
Organism:
Homo sapiens (Human)
Description:
O60674
Residue:
1132
  
Inhibitor
Name:
BDBM47432
Synonyms:
5,8,9-trimethyl-11H-indolo[3,2-c]quinolin-5-ium;iodide SMR000230188 | cid_10000306
Type:
Small organic molecule
Emp. Form.:
C18H17N2
Mol. Mass.:
261.3404
SMILES:
Cc1cc2[nH+]c3c(cn(C)c4ccccc34)c2cc1C
: