Target
Sphingosine 1-phosphate receptor 1
Ligand
BDBM47484
Substrate
Meas. Tech.
Fluorescence-based counterscreen assay for S1P4 agonists: Cell-based dose response high throughput screening assay to identify agonists of the Sphingosine 1-Phosphate Receptor 1 (S1P1)
EC50
7490±n/a nM
Citation
 PubChem, PC Fluorescence-based counterscreen assay for S1P4 agonists: Cell-based dose response high throughput screening assay to identify agonists of the Sphingosine 1-Phosphate Receptor 1 (S1P1) PubChem Bioassay (2010)[AID] 
Target
Name:
Sphingosine 1-phosphate receptor 1
Synonyms:
CHEDG1 Endothelial differentiation G-protein coupled receptor 1 S1P1 S1PR1_HUMAN Sphingosine 1-phosphate receptor Edg-1
Type:
Enzyme
Mol. Mass.:
42836.02
Organism:
Homo sapiens (Human)
Description:
P21453
Residue:
382
  
Inhibitor
Name:
BDBM47484
Synonyms:
1-(2,4-difluorophenyl)-4-(2,3-dimethoxyphenyl)-3-(2-thienyl)-2-pyrazoline 2-(2,4-difluorophenyl)-4-(2,3-dimethoxyphenyl)-5-thiophen-2-yl-3,4-dihydropyrazole MLS000548511 cid_4097071
Type:
Small organic molecule
Emp. Form.:
C21H18F2N2O2S
Mol. Mass.:
400.442
SMILES:
COc1cccc(C2CN(N=C2c2cccs2)c2ccc(F)cc2F)c1OC
: