Target
Solute carrier family 12 member 5
Ligand
BDBM44004
Substrate
Meas. Tech.
Identification of Novel Modulators of Cl- dependent Transport Process via HTS; Dose-dependent Assay with KCC2
EC50
3030±n/a nM
Citation
 PubChem, PC Identification of Novel Modulators of Cl- dependent Transport Process via HTS; Dose-dependent Assay with KCC2 PubChem Bioassay (2009)[AID] 
Target
Name:
Solute carrier family 12 member 5
Synonyms:
Electroneutral potassium-chloride cotransporter 2 KCC2 Neuronal K-Cl cotransporter SLC12A5 electroneutral potassium-chloride cotransporter KCC2 | hKCC2
Type:
PROTEIN
Mol. Mass.:
126185.18
Organism:
Homo sapiens (Human)
Description:
ChEMBL_828024
Residue:
1139
  
Inhibitor
Name:
BDBM44004
Synonyms:
MLS000556612 N-cyclohexyl-3-(2-furanyl)-4-phenylbutanamide N-cyclohexyl-3-(furan-2-yl)-4-phenyl-butanamide SMR000147929 | cid_3532483
Type:
Small organic molecule
Emp. Form.:
C20H25NO2
Mol. Mass.:
311.418
SMILES:
O=C(CC(Cc1ccccc1)c1ccco1)NC1CCCCC1
: