Target
Solute carrier family 12 member 5
Ligand
BDBM43901
Substrate
Meas. Tech.
Identification of Novel Modulators of Cl- dependent Transport Process via HTS; Dose-dependent Assay with KCC2
EC50
717±n/a nM
Citation
 PubChem, PC Identification of Novel Modulators of Cl- dependent Transport Process via HTS; Dose-dependent Assay with KCC2 PubChem Bioassay (2009)[AID] 
Target
Name:
Solute carrier family 12 member 5
Synonyms:
Electroneutral potassium-chloride cotransporter 2 KCC2 Neuronal K-Cl cotransporter SLC12A5 electroneutral potassium-chloride cotransporter KCC2 | hKCC2
Type:
PROTEIN
Mol. Mass.:
126185.18
Organism:
Homo sapiens (Human)
Description:
ChEMBL_828024
Residue:
1139
  
Inhibitor
Name:
BDBM43901
Synonyms:
2-[(4-fluorobenzyl)thio]-N-[2-(2-fluorophenoxy)ethyl]benzamide N-[2-(2-fluorophenoxy)ethyl]-2-[(4-fluorophenyl)methylsulfanyl]benzamide VU0269430-2-D15 | cid_573357
Type:
Small organic molecule
Emp. Form.:
C22H19F2NO2S
Mol. Mass.:
399.454
SMILES:
Fc1ccc(CSc2ccccc2C(=O)NCCOc2ccccc2F)cc1
: