Target
Muscarinic acetylcholine receptor M4
Ligand
BDBM43821
Substrate
Meas. Tech.
Discovery of novel allosteric modulators of the M1 muscarinic receptor: Agonist NMS competition at M4
Ki
6849±n/a nM
Citation
 PubChem, PC Discovery of novel allosteric modulators of the M1 muscarinic receptor: Agonist NMS competition at M4 PubChem Bioassay (2009)[AID] 
Target
Name:
Muscarinic acetylcholine receptor M4
Synonyms:
ACM4_RAT Chrm-4 | Chrm4
Type:
Enzyme Catalytic Domain
Mol. Mass.:
52841.70
Organism:
RAT
Description:
Cholinergic, muscarinic M4 CHRM4 RAT::P08485
Residue:
477
  
Inhibitor
Name:
BDBM43821
Synonyms:
4-(2-benzamidoethylamino)-1-piperidinecarboxylic acid ethyl ester;hydrochloride CHEMBL1609153 cid_25010774 | ethyl 4-(2-benzamidoethylamino)piperidine-1-carboxylate;hydrochloride
Type:
Small organic molecule
Emp. Form.:
C17H25N3O3
Mol. Mass.:
319.3987
SMILES:
CCOC(=O)N1CCC(CC1)NCCNC(=O)c1ccccc1
: