Target
SRSF protein kinase 1
Ligand
BDBM101830
Substrate
Meas. Tech.
In Vitro Kinase Assay
Temperature
303.15±n/a K
IC50
183±n/a nM
Comments
extracted
Citation
 Bates, DMorris, J Piperazine derivatives for treating disorders US Patent  US9695160 Publication Date 7/4/2017 
Target
Name:
SRSF protein kinase 1
Synonyms:
SRPK1 SRSF protein kinase 1 (SRPK1) Serine/threonine-protein kinase SRPK1
Type:
Protein
Mol. Mass.:
74318.38
Organism:
Homo sapiens (Human)
Description:
Q96SB4
Residue:
655
  
Inhibitor
Name:
BDBM101830
Synonyms:
US9695160, 43 | US9796707, Compound 43
Type:
Small organic molecule
Emp. Form.:
C21H20F3N5O2
Mol. Mass.:
431.411
SMILES:
FC(F)(F)c1ccc(N2CCN(Cc3cnccn3)CC2)c(NC(=O)c2ccco2)c1
: