Target
Gag-Pol polyprotein [600-1027,R876K]/[600-1155]
Ligand
BDBM2097
Substrate
poly(rC)500:oligo(dG)10
Meas. Tech.
HIV-1 RT Assay
IC50
90±n/a nM
Citation
 Klunder, JMHoermann, MCywin, CLDavid, EBrickwood, JRSchwartz, RBarringer, KJPauletti, DShih, CKErickson, DASorge, CLJoseph, DPHattox, SEAdams, JGrob, PM Novel nonnucleoside inhibitors of HIV-1 reverse transcriptase. 7. 8-Arylethyldipyridodiazepinones as potent broad-spectrum inhibitors of wild-type and mutant enzymes. J Med Chem 41:2960-71 (1998)  
Target
Name:
Gag-Pol polyprotein [600-1027,R876K]/[600-1155]
Synonyms:
EC: 2.7.7.49 | HIV-1 Reverse Transcriptase
Type:
Protein Complex
Mol. Mass.:
113858
Description:
Components:
This complex has 2 components.
Component 1
Name:
Gag-Pol polyprotein [600-1155]
Synonyms:
HIV-1 Reverse Transcriptase Chain A gag-pol
Type:
Enzyme Subunit
Mol. Mass.:
63928.81
Organism:
Human immunodeficiency virus type 1
Description:
P03366[600-1155]
Residue:
556
  
Component 2
Name:
Gag-Pol polyprotein [600-1027,R876K]
Synonyms:
HIV-1 Reverse Transcriptase Chain B gag-pol
Type:
Enzyme Subunit
Mol. Mass.:
49968.63
Organism:
Human immunodeficiency virus type 1
Description:
P03366[600-1027,R876K]
Residue:
428
  
Inhibitor
Name:
BDBM2097
Synonyms:
2,8-Substituted Dipyridodiazepinone 40 5,11-Dihydro-11-ethyl-2-iodo-8-[2-(4-pyridyl)ethyl]-5-methyl-6H-dipyrido[3,2-b:2 ,3 -e][1,4]diazepin-6-one
Type:
Small organic molecule
Emp. Form.:
C21H20IN5O
Mol. Mass.:
485.3209
SMILES:
CCN1c2nc(I)ccc2N(C)C(=O)c2cc(CCc3ccncc3)cnc12
:
Substrate
Name:
poly(rC)500:oligo(dG)10
Synonyms:
Type:
RNA\DNA duplex
Mol. Mass.:
358.43
Organism:
Description:
The incorporation of Tritium-labeled dGTP onto a (poly)rC:(oligo)dG template:primer.
Residue:
3
NA