Target
Gag-Pol polyprotein [600-1027,Y780C]/[600-1155,Y780C]
Ligand
BDBM2100
Substrate
poly(rC)500:oligo(dG)10
Meas. Tech.
HIV-1 RT Assay
IC50
1180±n/a nM
Citation
 Klunder, JMHoermann, MCywin, CLDavid, EBrickwood, JRSchwartz, RBarringer, KJPauletti, DShih, CKErickson, DASorge, CLJoseph, DPHattox, SEAdams, JGrob, PM Novel nonnucleoside inhibitors of HIV-1 reverse transcriptase. 7. 8-Arylethyldipyridodiazepinones as potent broad-spectrum inhibitors of wild-type and mutant enzymes. J Med Chem 41:2960-71 (1998)  
Target
Name:
Gag-Pol polyprotein [600-1027,Y780C]/[600-1155,Y780C]
Synonyms:
EC: 2.7.7.49 | HIV-1 Reverse Transcriptase Mutant (Y181C)
Type:
Protein Complex
Mol. Mass.:
115564
Description:
Components:
This complex has 2 components.
Component 1
Name:
Gag-Pol polyprotein [600-1155,Y780C]
Synonyms:
HIV-1 Reverse Transcriptase Mutant (Y181C) Chain A gag-pol
Type:
Enzyme Subunit
Mol. Mass.:
63868.77
Organism:
Human immunodeficiency virus type 1
Description:
P03366[600-1155,Y780C]
Residue:
556
  
Component 2
Name:
Gag-Pol polyprotein [600-1027,Y780C]
Synonyms:
HIV-1 Reverse Transcriptase Mutant (Y181C) Chain B gag-pol
Type:
Enzyme Subunit
Mol. Mass.:
49908.60
Organism:
Human immunodeficiency virus type 1
Description:
P03366[600-1027,Y780C]
Residue:
428
  
Inhibitor
Name:
BDBM2100
Synonyms:
2,8-Substituted Dipyridodiazepinone 43 | 5-chloro-2-ethyl-9-methyl-13-[2-(4-methylphenyl)ethyl]-2,4,9,15-tetraazatricyclo[9.4.0.0^{3,8}]pentadeca-1(15),3(8),4,6,11,13-hexaen-10-one
Type:
Small organic molecule
Emp. Form.:
C23H23ClN4O
Mol. Mass.:
406.908
SMILES:
CCN1c2nc(Cl)ccc2N(C)C(=O)c2cc(CCc3ccc(C)cc3)cnc12
:
Substrate
Name:
poly(rC)500:oligo(dG)10
Synonyms:
Type:
RNA\DNA duplex
Mol. Mass.:
358.43
Organism:
Description:
The incorporation of Tritium-labeled dGTP onto a (poly)rC:(oligo)dG template:primer.
Residue:
3
NA