Target
Glutathione S-transferase Mu 1
Ligand
BDBM44483
Substrate
Meas. Tech.
Profiling Assay to determine GST-GSH interactions in multiplex bead-based assays
EC50
201.5±n/a nM
Citation
 PubChem, PC Profiling Assay to determine GST-GSH interactions in multiplex bead-based assays PubChem Bioassay (2010)[AID] 
Target
Name:
Glutathione S-transferase Mu 1
Synonyms:
GST class-mu 1 GSTM1 GSTM1_HUMAN GSTM1b-1b Glutathione S-transferase Mu 1 glutathione S-transferase
Type:
PROTEIN
Mol. Mass.:
25712.03
Organism:
Homo sapiens (Human)
Description:
ChEMBL_799596
Residue:
218
  
Inhibitor
Name:
BDBM44483
Synonyms:
(5Z)-3-butan-2-yl-5-[[9-methyl-4-oxidanylidene-2-(3-propan-2-yloxypropylamino)pyrido[1,2-a]pyrimidin-3-yl]methylidene]-2-sulfanylidene-1,3-thiazolidin-4-one (5Z)-3-butan-2-yl-5-[[9-methyl-4-oxo-2-(3-propan-2-yloxypropylamino)pyrido[1,2-a]pyrimidin-3-yl]methylidene]-2-sulfanylidene-1,3-thiazolidin-4-one 3-[3-sec-Butyl-4-oxo-2-thioxo-thiazolidin-(5Z)-ylidenemethyl]-2-(3-isopropoxy-propylamino)-9-methyl-py rido[1,2-a]pyrimidin-4-one SMR000148136 | cid_6297320
Type:
Small organic molecule
Emp. Form.:
C23H30N4O3S2
Mol. Mass.:
474.639
SMILES:
CCC(C)N1C(=S)S\C(=C/c2c(NCCCOC(C)C)nc3c(C)cccn3c2=O)C1=O
: