Target
Glutathione S-transferase Mu 1
Ligand
BDBM34783
Substrate
Meas. Tech.
Profiling Assay to determine GST-GSH interactions in multiplex bead-based assays
EC50
830.6±n/a nM
Citation
 PubChem, PC Profiling Assay to determine GST-GSH interactions in multiplex bead-based assays PubChem Bioassay (2010)[AID] 
Target
Name:
Glutathione S-transferase Mu 1
Synonyms:
GST class-mu 1 GSTM1 GSTM1_HUMAN GSTM1b-1b Glutathione S-transferase Mu 1 glutathione S-transferase
Type:
PROTEIN
Mol. Mass.:
25712.03
Organism:
Homo sapiens (Human)
Description:
ChEMBL_799596
Residue:
218
  
Inhibitor
Name:
BDBM34783
Synonyms:
(4E)-4-[[2-[2-(3,5-dimethylpyrazol-1-yl)-6-methyl-pyrimidin-4-yl]hydrazinyl]methylidene]-3-oxidanyl-cyclohexa-2,5-dien-1-one (4E)-4-[[N'-[2-(3,5-dimethylpyrazol-1-yl)-6-methyl-pyrimidin-4-yl]hydrazino]methylene]-3-hydroxy-cyclohexa-2,5-dien-1-one 4-{[2-(3,5-Dimethyl-pyrazol-1-yl)-6-methyl-pyrimidin-4-yl]-hydrazonomethyl}-benzene-1,3-diol SMR000212745 | cid_6517627
Type:
Small organic molecule
Emp. Form.:
C17H18N6O2
Mol. Mass.:
338.3638
SMILES:
Cc1cc(C)n(n1)-c1nc(C)cc(N=NCc2ccc(O)cc2O)n1
: