Target
Glutathione S-transferase Mu 1
Ligand
BDBM47635
Substrate
Meas. Tech.
Profiling Assay to determine GST-GSH interactions in multiplex bead-based assays
EC50
20990±n/a nM
Citation
 PubChem, PC Profiling Assay to determine GST-GSH interactions in multiplex bead-based assays PubChem Bioassay (2010)[AID] 
Target
Name:
Glutathione S-transferase Mu 1
Synonyms:
GST class-mu 1 GSTM1 GSTM1_HUMAN GSTM1b-1b Glutathione S-transferase Mu 1 glutathione S-transferase
Type:
PROTEIN
Mol. Mass.:
25712.03
Organism:
Homo sapiens (Human)
Description:
ChEMBL_799596
Residue:
218
  
Inhibitor
Name:
BDBM47635
Synonyms:
(2Z)-2-[(1,6-dimethyl-2-quinolin-1-iumyl)methylidene]-1-ethylthieno[3,2-e][1,3]benzothiazole;iodide (2Z)-2-[(1,6-dimethylquinolin-1-ium-2-yl)methylidene]-1-ethyl-thieno[3,2-e][1,3]benzothiazole;iodide MLS000693112 cid_16192912
Type:
Small organic molecule
Emp. Form.:
C23H21N2S2
Mol. Mass.:
389.556
SMILES:
CCN1\C(Sc2ccc3sccc3c12)=C\c1ccc2cc(C)ccc2[n+]1C
: