Target
Glutathione S-transferase Mu 1
Ligand
BDBM47648
Substrate
Meas. Tech.
Profiling Assay to determine GST-GSH interactions in multiplex bead-based assays
EC50
1322±n/a nM
Citation
 PubChem, PC Profiling Assay to determine GST-GSH interactions in multiplex bead-based assays PubChem Bioassay (2010)[AID] 
Target
Name:
Glutathione S-transferase Mu 1
Synonyms:
GST class-mu 1 GSTM1 GSTM1_HUMAN GSTM1b-1b Glutathione S-transferase Mu 1 glutathione S-transferase
Type:
PROTEIN
Mol. Mass.:
25712.03
Organism:
Homo sapiens (Human)
Description:
ChEMBL_799596
Residue:
218
  
Inhibitor
Name:
BDBM47648
Synonyms:
4-(cycloheptylamino)-6,7-dimethoxy-1H-quinazoline-2-thione MLS000871724 cid_4280127
Type:
Small organic molecule
Emp. Form.:
C17H23N3O2S
Mol. Mass.:
333.448
SMILES:
COc1cc2nc(=S)[nH]c(NC3CCCCCC3)c2cc1OC
: