Target
Glutathione S-transferase Mu 1
Ligand
BDBM32321
Substrate
Meas. Tech.
Profiling Assay to determine GST-GSH interactions in multiplex bead-based assays
EC50
35140±n/a nM
Citation
 PubChem, PC Profiling Assay to determine GST-GSH interactions in multiplex bead-based assays PubChem Bioassay (2010)[AID] 
Target
Name:
Glutathione S-transferase Mu 1
Synonyms:
GST class-mu 1 GSTM1 GSTM1_HUMAN GSTM1b-1b Glutathione S-transferase Mu 1 glutathione S-transferase
Type:
PROTEIN
Mol. Mass.:
25712.03
Organism:
Homo sapiens (Human)
Description:
ChEMBL_799596
Residue:
218
  
Inhibitor
Name:
BDBM32321
Synonyms:
2-[(3-pyridin-4-yl-[1,2,4]triazolo[4,3-b]pyridazin-6-yl)sulfanyl]-N-(1,3-thiazol-2-yl)acetamide 2-[(3-pyridin-4-yl-[1,2,4]triazolo[4,3-b]pyridazin-6-yl)thio]-N-(2-thiazolyl)acetamide MLS000419508 cid_7190885
Type:
Small organic molecule
Emp. Form.:
C15H11N7OS2
Mol. Mass.:
369.424
SMILES:
O=C(CSc1ccc2nnc(-c3ccncc3)n2n1)Nc1nccs1
: