Target
Glutathione S-transferase Mu 1
Ligand
BDBM47664
Substrate
Meas. Tech.
Profiling Assay to determine GST-GSH interactions in multiplex bead-based assays
EC50
334.1±n/a nM
Citation
 PubChem, PC Profiling Assay to determine GST-GSH interactions in multiplex bead-based assays PubChem Bioassay (2010)[AID] 
Target
Name:
Glutathione S-transferase Mu 1
Synonyms:
GST class-mu 1 GSTM1 GSTM1_HUMAN GSTM1b-1b Glutathione S-transferase Mu 1 glutathione S-transferase
Type:
PROTEIN
Mol. Mass.:
25712.03
Organism:
Homo sapiens (Human)
Description:
ChEMBL_799596
Residue:
218
  
Inhibitor
Name:
BDBM47664
Synonyms:
6,7-dimethoxy-4-[2-(4-methylphenyl)ethylamino]-1H-quinazoline-2-thione 6,7-dimethoxy-4-{[2-(4-methylphenyl)ethyl]amino}quinazoline-2(1H)-thione SMR000309246 | cid_15996835
Type:
Small organic molecule
Emp. Form.:
C19H21N3O2S
Mol. Mass.:
355.454
SMILES:
COc1cc2nc(=S)[nH]c(NCCc3ccc(C)cc3)c2cc1OC
: