Target
Glutathione S-transferase Mu 1
Ligand
BDBM47671
Substrate
Meas. Tech.
Profiling Assay to determine GST-GSH interactions in multiplex bead-based assays
EC50
8594±n/a nM
Citation
 PubChem, PC Profiling Assay to determine GST-GSH interactions in multiplex bead-based assays PubChem Bioassay (2010)[AID] 
Target
Name:
Glutathione S-transferase Mu 1
Synonyms:
GST class-mu 1 GSTM1 GSTM1_HUMAN GSTM1b-1b Glutathione S-transferase Mu 1 glutathione S-transferase
Type:
PROTEIN
Mol. Mass.:
25712.03
Organism:
Homo sapiens (Human)
Description:
ChEMBL_799596
Residue:
218
  
Inhibitor
Name:
BDBM47671
Synonyms:
3-nitro-N'-[(1E)-quinoxalin-6-ylmethylene]benzohydrazide 3-nitro-N-(quinoxalin-6-ylmethyleneamino)benzamide MLS000621266 cid_5072680
Type:
Small organic molecule
Emp. Form.:
C16H11N5O3
Mol. Mass.:
321.2902
SMILES:
[O-][N+](=O)c1cccc(c1)C(=O)N\N=C\c1ccc2nccnc2c1
: