Target
Glutathione S-transferase Mu 1
Ligand
BDBM47679
Substrate
Meas. Tech.
Profiling Assay to determine GST-GSH interactions in multiplex bead-based assays
EC50
7617±n/a nM
Citation
 PubChem, PC Profiling Assay to determine GST-GSH interactions in multiplex bead-based assays PubChem Bioassay (2010)[AID] 
Target
Name:
Glutathione S-transferase Mu 1
Synonyms:
GST class-mu 1 GSTM1 GSTM1_HUMAN GSTM1b-1b Glutathione S-transferase Mu 1 glutathione S-transferase
Type:
PROTEIN
Mol. Mass.:
25712.03
Organism:
Homo sapiens (Human)
Description:
ChEMBL_799596
Residue:
218
  
Inhibitor
Name:
BDBM47679
Synonyms:
7-nitro-3-[2-(trifluoromethyl)benzyl]quinazolin-4-one 7-nitro-3-[[2-(trifluoromethyl)phenyl]methyl]quinazolin-4-one SMR000344660 | cid_2608392
Type:
Small organic molecule
Emp. Form.:
C16H10F3N3O3
Mol. Mass.:
349.2641
SMILES:
[O-][N+](=O)c1ccc2c(c1)ncn(Cc1ccccc1C(F)(F)F)c2=O
: