Target
Regulator of G-protein signaling 8
Ligand
BDBM38361
Substrate
Meas. Tech.
Dose respone, multiplexed high-throughput screen for small molecule regulators of RGS family protein interactions, specifically RGS8-Galphao.
EC50
10400±n/a nM
Citation
 PubChem, PC Dose respone, multiplexed high-throughput screen for small molecule regulators of RGS family protein interactions, specifically RGS8-Galphao. PubChem Bioassay (2009)[AID] 
Target
Name:
Regulator of G-protein signaling 8
Synonyms:
RGS8 Regulator of G-protein signaling 8 (RGS8)
Type:
Enzyme Catalytic Domain
Mol. Mass.:
20925.80
Organism:
Homo sapiens (Human)
Description:
gi_74355113
Residue:
180
  
Inhibitor
Name:
BDBM38361
Synonyms:
2-(4-pyrrolidin-1-ylsulfonylphenyl)-1,2-benzothiazol-3-one 2-[4-(1-pyrrolidinylsulfonyl)phenyl]-1,2-benzothiazol-3-one SMR000060746 | cid_2325816
Type:
Small organic molecule
Emp. Form.:
C17H16N2O3S2
Mol. Mass.:
360.451
SMILES:
O=c1n(sc2ccccc12)-c1ccc(cc1)S(=O)(=O)N1CCCC1
: