Target
Regulator of G-protein signaling 8
Ligand
BDBM34513
Substrate
Meas. Tech.
Dose respone, multiplexed high-throughput screen for small molecule regulators of RGS family protein interactions, specifically RGS8-Galphao.
EC50
4650±n/a nM
Citation
 PubChem, PC Dose respone, multiplexed high-throughput screen for small molecule regulators of RGS family protein interactions, specifically RGS8-Galphao. PubChem Bioassay (2009)[AID] 
Target
Name:
Regulator of G-protein signaling 8
Synonyms:
RGS8 Regulator of G-protein signaling 8 (RGS8)
Type:
Enzyme Catalytic Domain
Mol. Mass.:
20925.80
Organism:
Homo sapiens (Human)
Description:
gi_74355113
Residue:
180
  
Inhibitor
Name:
BDBM34513
Synonyms:
MLS000118887 N-[2-(2,5-dimethoxyphenyl)ethyl]-2-(4,6-dimethyl-3-oxidanylidene-[1,2]thiazolo[5,4-b]pyridin-2-yl)ethanamide N-[2-(2,5-dimethoxyphenyl)ethyl]-2-(4,6-dimethyl-3-oxo-[1,2]thiazolo[5,4-b]pyridin-2-yl)acetamide US9011882, Table 1, Compound 15 | cid_5309169
Type:
Small organic molecule
Emp. Form.:
C20H23N3O4S
Mol. Mass.:
401.479
SMILES:
COc1ccc(OC)c(CCNC(=O)Cn2sc3nc(C)cc(C)c3c2=O)c1
: