Target
Regulator of G-protein signaling 8
Ligand
BDBM33097
Substrate
Meas. Tech.
Dose respone, multiplexed high-throughput screen for small molecule regulators of RGS family protein interactions, specifically RGS8-Galphao.
EC50
>30000±n/a nM
Citation
 PubChem, PC Dose respone, multiplexed high-throughput screen for small molecule regulators of RGS family protein interactions, specifically RGS8-Galphao. PubChem Bioassay (2009)[AID] 
Target
Name:
Regulator of G-protein signaling 8
Synonyms:
RGS8 Regulator of G-protein signaling 8 (RGS8)
Type:
Enzyme Catalytic Domain
Mol. Mass.:
20925.80
Organism:
Homo sapiens (Human)
Description:
gi_74355113
Residue:
180
  
Inhibitor
Name:
BDBM33097
Synonyms:
3-[[7-(1,3-benzothiazol-2-ylsulfanyl)-4-nitro-2,1,3-benzoxadiazol-5-yl]amino]propyl acetate MLS000521052 acetic acid 3-[[7-(1,3-benzothiazol-2-ylthio)-4-nitro-2,1,3-benzoxadiazol-5-yl]amino]propyl ester cid_11957209
Type:
Small organic molecule
Emp. Form.:
C18H15N5O5S2
Mol. Mass.:
445.472
SMILES:
CC(=O)OCCCNc1cc(Sc2nc3ccccc3s2)c2nonc2c1[N+]([O-])=O
: