Target
Regulator of G-protein signaling 8
Ligand
BDBM47739
Substrate
Meas. Tech.
Dose respone, multiplexed high-throughput screen for small molecule regulators of RGS family protein interactions, specifically RGS8-Galphao.
EC50
>30000±n/a nM
Citation
 PubChem, PC Dose respone, multiplexed high-throughput screen for small molecule regulators of RGS family protein interactions, specifically RGS8-Galphao. PubChem Bioassay (2009)[AID] 
Target
Name:
Regulator of G-protein signaling 8
Synonyms:
RGS8 Regulator of G-protein signaling 8 (RGS8)
Type:
Enzyme Catalytic Domain
Mol. Mass.:
20925.80
Organism:
Homo sapiens (Human)
Description:
gi_74355113
Residue:
180
  
Inhibitor
Name:
BDBM47739
Synonyms:
MLS000586341 N-[1-(cyclohexylcarbamoyl)cyclohexyl]-N-(thiophen-2-ylmethyl)pyrazine-2-carboxamide N-{1-[(cyclohexylamino)carbonyl]cyclohexyl}-N-(thien-2-ylmethyl)pyrazine-2-carboxamide cid_4014737
Type:
Small organic molecule
Emp. Form.:
C23H30N4O2S
Mol. Mass.:
426.575
SMILES:
O=C(NC1CCCCC1)C1(CCCCC1)N(Cc1cccs1)C(=O)c1cnccn1
: