Target
Regulator of G-protein signaling 8
Ligand
BDBM33145
Substrate
Meas. Tech.
Dose respone, multiplexed high-throughput screen for small molecule regulators of RGS family protein interactions, specifically RGS8-Galphao.
EC50
4550±n/a nM
Citation
 PubChem, PC Dose respone, multiplexed high-throughput screen for small molecule regulators of RGS family protein interactions, specifically RGS8-Galphao. PubChem Bioassay (2009)[AID] 
Target
Name:
Regulator of G-protein signaling 8
Synonyms:
RGS8 Regulator of G-protein signaling 8 (RGS8)
Type:
Enzyme Catalytic Domain
Mol. Mass.:
20925.80
Organism:
Homo sapiens (Human)
Description:
gi_74355113
Residue:
180
  
Inhibitor
Name:
BDBM33145
Synonyms:
3-[[[(E)-(2,3-dihydroxy-4-keto-cyclohexa-2,5-dien-1-ylidene)methyl]amino]carbamoyl]-N,N-diethyl-benzenesulfonamide 3-[[[(E)-(2,3-dihydroxy-4-oxocyclohexa-2,5-dien-1-ylidene)methyl]amino]carbamoyl]-N,N-diethylbenzenesulfonamide 3-[[[(Z)-(2,3-dihydroxy-4-keto-cyclohexa-2,5-dien-1-ylidene)methyl]amino]carbamoyl]-N,N-diethyl-benzenesulfonamide SMR000244048 | cid_6263555
Type:
Small organic molecule
Emp. Form.:
C18H21N3O6S
Mol. Mass.:
407.441
SMILES:
CCN(CC)S(=O)(=O)c1cccc(c1)C(=O)NN=Cc1ccc(O)c(O)c1O
: