Target
Regulator of G-protein signaling 8
Ligand
BDBM34966
Substrate
Meas. Tech.
Dose respone, multiplexed high-throughput screen for small molecule regulators of RGS family protein interactions, specifically RGS8-Galphao.
EC50
4000±n/a nM
Citation
 PubChem, PC Dose respone, multiplexed high-throughput screen for small molecule regulators of RGS family protein interactions, specifically RGS8-Galphao. PubChem Bioassay (2009)[AID] 
Target
Name:
Regulator of G-protein signaling 8
Synonyms:
RGS8 Regulator of G-protein signaling 8 (RGS8)
Type:
Enzyme Catalytic Domain
Mol. Mass.:
20925.80
Organism:
Homo sapiens (Human)
Description:
gi_74355113
Residue:
180
  
Inhibitor
Name:
BDBM34966
Synonyms:
3-(3-keto-1,2-benzothiazol-2-yl)-N,N-dimethyl-benzenesulfonamide N,N-dimethyl-3-(3-oxidanylidene-1,2-benzothiazol-2-yl)benzenesulfonamide SMR000364449 | cid_5040456
Type:
Small organic molecule
Emp. Form.:
C15H14N2O3S2
Mol. Mass.:
334.413
SMILES:
CN(C)S(=O)(=O)c1cccc(c1)-n1sc2ccccc2c1=O
: