Target
Regulator of G-protein signaling 7
Ligand
BDBM47726
Substrate
Meas. Tech.
Dose response, multiplexed high-throughput screen for small molecule regulators of RGS family protein interactions, specifically RGS7-Galphao.
EC50
>30000±n/a nM
Citation
 PubChem, PC Dose response, multiplexed high-throughput screen for small molecule regulators of RGS family protein interactions, specifically RGS7-Galphao. PubChem Bioassay (2009)[AID] 
Target
Name:
Regulator of G-protein signaling 7
Synonyms:
RGS7 | RGS7_HUMAN
Type:
Enzyme Catalytic Domain
Mol. Mass.:
57675.72
Organism:
Homo sapiens (Human)
Description:
P49802
Residue:
495
  
Inhibitor
Name:
BDBM47726
Synonyms:
3-[(5-methyl-2-pyridyl)carbamoyl]-5-nitro-benzoic acid methyl ester MLS000561314 SMR000177252 methyl 3-[(5-methylpyridin-2-yl)carbamoyl]-5-nitro-benzoate | methyl 3-[(5-methylpyridin-2-yl)carbamoyl]-5-nitrobenzoate
Type:
Small organic molecule
Emp. Form.:
C15H13N3O5
Mol. Mass.:
315.2808
SMILES:
COC(=O)c1cc(cc(c1)[N+]([O-])=O)C(=O)Nc1ccc(C)cn1
: